Target
PC4 and SFRS1-interacting protein
Ligand
BDBM50578
Substrate
Meas. Tech.
Counterscreen for inhibitors of LEDGF/p75-dependent integration: TR-FRET-based biochemical high throughput dose response counterscreen assay to identify activators of HIV-1 Integrase multimerization
IC50
869.51±n/a nM
Citation
 PubChem, PC Counterscreen for inhibitors of LEDGF/p75-dependent integration: TR-FRET-based biochemical high throughput dose response counterscreen assay to identify activators of HIV-1 Integrase multimerization PubChem Bioassay (2014)[AID] 
Target
Name:
PC4 and SFRS1-interacting protein
Synonyms:
DFS70 LEDGF/p75 PSIP1_HUMAN lens epithelium-derived growth factor p75
Type:
Enzyme Catalytic Domain
Mol. Mass.:
60120.68
Organism:
Homo sapiens (Human)
Description:
gi_6708281
Residue:
530
  
Inhibitor
Name:
BDBM50578
Synonyms:
3-[6-(hydroxymethyl)-3,4,5-tris(oxidanyl)oxan-2-yl]oxy-5-phenyl-pentanoic acid 5-phenyl-3-[3,4,5-trihydroxy-6-(hydroxymethyl)oxan-2-yl]oxypentanoic acid MLS000877001 cid_16681750
Type:
Small organic molecule
Emp. Form.:
C17H24O8
Mol. Mass.:
356.3677
SMILES:
OCC1OC(OC(CCc2ccccc2)CC(O)=O)C(O)C(O)C1O
: