Target
PC4 and SFRS1-interacting protein
Ligand
BDBM52992
Substrate
Meas. Tech.
Counterscreen for inhibitors of LEDGF/p75-dependent integration: TR-FRET-based biochemical high throughput dose response counterscreen assay to identify activators of HIV-1 Integrase multimerization
IC50
84.96±n/a nM
Citation
 PubChem, PC Counterscreen for inhibitors of LEDGF/p75-dependent integration: TR-FRET-based biochemical high throughput dose response counterscreen assay to identify activators of HIV-1 Integrase multimerization PubChem Bioassay (2014)[AID] 
Target
Name:
PC4 and SFRS1-interacting protein
Synonyms:
DFS70 LEDGF/p75 PSIP1_HUMAN lens epithelium-derived growth factor p75
Type:
Enzyme Catalytic Domain
Mol. Mass.:
60120.68
Organism:
Homo sapiens (Human)
Description:
gi_6708281
Residue:
530
  
Inhibitor
Name:
BDBM52992
Synonyms:
4,5,7,8-tetrahydroxy-1,2-naphthoquinone 4,5,7,8-tetrakis(oxidanyl)naphthalene-1,2-dione Mopain cid_75583
Type:
Small organic molecule
Emp. Form.:
C10H6O6
Mol. Mass.:
222.151
SMILES:
Oc1cc(O)c2C(=O)CC(=O)C(=O)c2c1O
: