Target
PC4 and SFRS1-interacting protein
Ligand
BDBM84007
Substrate
Meas. Tech.
Counterscreen for inhibitors of LEDGF/p75-dependent integration: TR-FRET-based biochemical high throughput dose response counterscreen assay to identify activators of HIV-1 Integrase multimerization
IC50
759.02±n/a nM
Citation
 PubChem, PC Counterscreen for inhibitors of LEDGF/p75-dependent integration: TR-FRET-based biochemical high throughput dose response counterscreen assay to identify activators of HIV-1 Integrase multimerization PubChem Bioassay (2014)[AID] 
Target
Name:
PC4 and SFRS1-interacting protein
Synonyms:
DFS70 LEDGF/p75 PSIP1_HUMAN lens epithelium-derived growth factor p75
Type:
Enzyme Catalytic Domain
Mol. Mass.:
60120.68
Organism:
Homo sapiens (Human)
Description:
gi_6708281
Residue:
530
  
Inhibitor
Name:
BDBM84007
Synonyms:
CEFIXIME MLS002222332 cid_5362065
Type:
Small organic molecule
Emp. Form.:
C16H15N5O7S2
Mol. Mass.:
453.45
SMILES:
Nc1nc(cs1)C(=N\OCC(O)=O)\C(=O)N[C@H]1[C@H]2SCC(C=C)=C(N2C1=O)C(O)=O
: