Target
PC4 and SFRS1-interacting protein
Ligand
BDBM48826
Substrate
Meas. Tech.
TR-FRET-based biochemical high throughput dose response assay to identify inhibitors of HIV-1 LEDGF/p75 DNA Integration
IC50
575.43±n/a nM
Citation
 PubChem, PC TR-FRET-based biochemical high throughput dose response assay to identify inhibitors of HIV-1 LEDGF/p75 DNA Integration PubChem Bioassay (2014)[AID] 
Target
Name:
PC4 and SFRS1-interacting protein
Synonyms:
DFS70 LEDGF/p75 PSIP1_HUMAN lens epithelium-derived growth factor p75
Type:
Enzyme Catalytic Domain
Mol. Mass.:
60120.68
Organism:
Homo sapiens (Human)
Description:
gi_6708281
Residue:
530
  
Inhibitor
Name:
BDBM48826
Synonyms:
8-acetyl-3a,4,5,9b-tetrahydro-3H-cyclopenta[c]quinoline-4-carboxylic acid MLS000713690 US11584714, Compound 30 | cid_3136298
Type:
Small organic molecule
Emp. Form.:
C15H15NO3
Mol. Mass.:
257.2845
SMILES:
CC(=O)c1ccc2NC(C3CC=CC3c2c1)C(O)=O
: