Target
PC4 and SFRS1-interacting protein
Ligand
BDBM50056938
Substrate
Meas. Tech.
TR-FRET-based biochemical high throughput dose response assay to identify inhibitors of HIV-1 LEDGF/p75 DNA Integration
IC50
211.9±n/a nM
Citation
 PubChem, PC TR-FRET-based biochemical high throughput dose response assay to identify inhibitors of HIV-1 LEDGF/p75 DNA Integration PubChem Bioassay (2014)[AID] 
Target
Name:
PC4 and SFRS1-interacting protein
Synonyms:
DFS70 LEDGF/p75 PSIP1_HUMAN lens epithelium-derived growth factor p75
Type:
Enzyme Catalytic Domain
Mol. Mass.:
60120.68
Organism:
Homo sapiens (Human)
Description:
gi_6708281
Residue:
530
  
Inhibitor
Name:
BDBM50056938
Synonyms:
2,6,7-Trihydroxy-9-methyl-xanthen-3-one NSC-66209 cid_72721
Type:
Small organic molecule
Emp. Form.:
C14H10O5
Mol. Mass.:
258.2262
SMILES:
Cc1c2cc(O)c(O)cc2oc2cc(=O)c(O)cc12
: