Target
PC4 and SFRS1-interacting protein
Ligand
BDBM114257
Substrate
Meas. Tech.
TR-FRET-based biochemical high throughput dose response assay to identify inhibitors of HIV-1 LEDGF/p75 DNA Integration
IC50
243.78±n/a nM
Citation
 PubChem, PC TR-FRET-based biochemical high throughput dose response assay to identify inhibitors of HIV-1 LEDGF/p75 DNA Integration PubChem Bioassay (2014)[AID] 
Target
Name:
PC4 and SFRS1-interacting protein
Synonyms:
DFS70 LEDGF/p75 PSIP1_HUMAN lens epithelium-derived growth factor p75
Type:
Enzyme Catalytic Domain
Mol. Mass.:
60120.68
Organism:
Homo sapiens (Human)
Description:
gi_6708281
Residue:
530
  
Inhibitor
Name:
BDBM114257
Synonyms:
3,8,9,10-tetrahydroxypyran[3,2-c]isochromene-2,6-quinone 3,8,9,10-tetrahydroxypyrano[3,2-c]isochromene-2,6-dione Galloflavin SMR000528495 | cid_54683147
Type:
Small organic molecule
Emp. Form.:
C12H6O8
Mol. Mass.:
278.1712
SMILES:
Oc1cc2c(c(O)c1O)c1oc(=O)c(O)cc1oc2=O
: