Target
PC4 and SFRS1-interacting protein
Ligand
BDBM4293
Substrate
Meas. Tech.
TR-FRET-based biochemical high throughput dose response assay to identify inhibitors of HIV-1 LEDGF/p75 DNA Integration
IC50
79.55±n/a nM
Citation
 PubChem, PC TR-FRET-based biochemical high throughput dose response assay to identify inhibitors of HIV-1 LEDGF/p75 DNA Integration PubChem Bioassay (2014)[AID] 
Target
Name:
PC4 and SFRS1-interacting protein
Synonyms:
DFS70 LEDGF/p75 PSIP1_HUMAN lens epithelium-derived growth factor p75
Type:
Enzyme Catalytic Domain
Mol. Mass.:
60120.68
Organism:
Homo sapiens (Human)
Description:
gi_6708281
Residue:
530
  
Inhibitor
Name:
BDBM4293
Synonyms:
(2E)-3-(3,4-dihydroxyphenyl)-2-[(3,4-dihydroxyphenyl)carbonyl]prop-2-enenitrile Tyrphostin deriv. 24 | cid_5328760
Type:
Small organic molecule
Emp. Form.:
C16H11NO5
Mol. Mass.:
297.2622
SMILES:
Oc1ccc(\C=C(/C#N)C(=O)c2ccc(O)c(O)c2)cc1O
: