Target
Beta-secretase 2
Ligand
BDBM116269
Substrate
Meas. Tech.
Inhibition Assay
pH
4.5±n/a
Temperature
298.15±n/a K
IC50
5±n/a nM
Comments
extracted
Citation
 Badiger, SChebrolu, MHurth, KJacquier, SLueoend, RMMachauer, RRueeger, HTintelnot-Blomley, MVeenstra, SJVoegtle, M Heterocyclic derivatives and their use in the treatment of neurological disorders US Patent  US8637508 Publication Date 1/28/2014 
Target
Name:
Beta-secretase 2
Synonyms:
AEPLC ASP1 Asp 1 Aspartyl protease 1 BACE2_HUMAN Beta-secretase (BACE) Beta-secretase 2 (BACE-2) Beta-site APP-cleaving enzyme 2 Memapsin-1 beta-Secretase (BACE-2)
Type:
Protein
Mol. Mass.:
56171.20
Organism:
Homo sapiens (Human)
Description:
Q9Y5Z0
Residue:
518
  
Inhibitor
Name:
BDBM116269
Synonyms:
US10035794, Example 46 | US8637508, 46
Type:
Small organic molecule
Emp. Form.:
C17H15ClF6N6O2
Mol. Mass.:
484.783
SMILES:
C[C@]1(CO[C@](C)(C(N)=N1)C(F)(F)F)c1nc(NC(=O)c2nn(cc2Cl)C(F)F)ccc1F
: