Target
Serine/threonine-protein kinase B-raf [V600E]
Ligand
BDBM117711
Substrate
Meas. Tech.
kinase Assay
pH
7.5±n/a
IC50
1±n/a nM
Comments
extracted
Citation
 Mantoulidis, ADahmann, GEttmayer, PKlein, CSteurer, SWaizenegger, IZahn, SK Pyrido [5, 4-D] pyrimidines as cell proliferation inhibitors US Patent  US8653087 Publication Date 2/18/2014 
Target
Name:
Serine/threonine-protein kinase B-raf [V600E]
Synonyms:
B-RAF V600E B-Raf Protein Kinase Mutant (V600E) BRAF BRAF mutant V600E BRAF_HUMAN Protein mono-ADP-ribosyltransferase (PARP3) RAFB1 Serine/threonine-protein kinase B-raf (V600E) V-RAF murine sarcoma viral oncogene homologue B1 mutant (BRAF V600E)
Type:
Mol. Mass.:
84474.98
Organism:
Homo sapiens (Human)
Description:
P15056 V600E
Residue:
766
  
Inhibitor
Name:
BDBM117711
Synonyms:
US8653087, III-391
Type:
Small organic molecule
Emp. Form.:
C24H26FN9O2
Mol. Mass.:
491.5207
SMILES:
CC(C)(C)c1cc(NC(=O)c2ccc(F)c(Nc3ncnc4cnc(nc34)N3CCOCC3)c2)[nH]n1
: