Target
Serine/threonine-protein kinase B-raf [V600E]
Ligand
BDBM117714
Substrate
Meas. Tech.
kinase Assay
pH
7.5±n/a
IC50
1±n/a nM
Comments
extracted
Citation
 Mantoulidis, ADahmann, GEttmayer, PKlein, CSteurer, SWaizenegger, IZahn, SK Pyrido [5, 4-D] pyrimidines as cell proliferation inhibitors US Patent  US8653087 Publication Date 2/18/2014 
Target
Name:
Serine/threonine-protein kinase B-raf [V600E]
Synonyms:
B-RAF V600E B-Raf Protein Kinase Mutant (V600E) BRAF BRAF mutant V600E BRAF_HUMAN Protein mono-ADP-ribosyltransferase (PARP3) RAFB1 Serine/threonine-protein kinase B-raf (V600E) V-RAF murine sarcoma viral oncogene homologue B1 mutant (BRAF V600E)
Type:
Mol. Mass.:
84474.98
Organism:
Homo sapiens (Human)
Description:
P15056 V600E
Residue:
766
  
Inhibitor
Name:
BDBM117714
Synonyms:
US8653087, III-394
Type:
Small organic molecule
Emp. Form.:
C31H39FN10O2
Mol. Mass.:
602.7056
SMILES:
CN1CCC(CN2CCN(CC2)c2ncc3ncnc(Nc4cc(ccc4F)C(=O)Nc4cc(on4)C(C)(C)C)c3n2)CC1
: