Target
Aldehyde dehydrogenase, mitochondrial
Ligand
BDBM118200
Substrate
Meas. Tech.
ALDH2 Assay
pH
7.4±n/a
IC50
90±n/a nM
Comments
extracted
Citation
 Graupe, MVenkataramani, CZablocki, J ALDH-2 inhibitors in the treatment of addiction US Patent  US8673966 Publication Date 3/18/2014 
Target
Name:
Aldehyde dehydrogenase, mitochondrial
Synonyms:
ALDH class 2 ALDH2 ALDHI Aldehyde dehydrogenase (ALDH2)
Type:
Enzyme
Mol. Mass.:
56382.67
Organism:
Homo sapiens (Human)
Description:
P05091
Residue:
517
  
Inhibitor
Name:
BDBM118200
Synonyms:
US8673966, N-(4-(4-oxo-7-(pyridin-2-ylethynyl)-4H- chromen-3-yl)phenyl)methanesulfonamide
Type:
Emp. Form.:
C23H16N2O4S
Mol. Mass.:
416.449
SMILES:
CS(=O)(=O)Nc1ccc(cc1)-c1coc2cc(ccc2c1=O)C#Cc1ccccn1
: