Target
Orexin/Hypocretin receptor type 1
Ligand
BDBM118380
Substrate
Meas. Tech.
Biological Assay
Ki
488±n/a nM
Citation
 Chai, WLetavic, MALy, KSPippel, DJRudolph, DASappey, KCSavall, BMShah, CRShireman, BTSoyode-Johnson, AStocking, EMSwanson, DM Disubstituted octahydropyrrolo[3,4-c]pyrroles as orexin receptor modulators US Patent  US8653263 Publication Date 2/18/2014 
Target
Name:
Orexin/Hypocretin receptor type 1
Synonyms:
HCRTR1 OX1R_HUMAN Orexin receptor type 1 (OR 1) Orexin receptor type 1 (OX1) Orexin receptor type 1 (OxR1) | Ox1r
Type:
Protein
Mol. Mass.:
47554.50
Organism:
Homo sapiens (Human)
Description:
O43613
Residue:
425
  
Inhibitor
Name:
BDBM118380
Synonyms:
US11059828, Example 33 US8653263, 33 USRE48841, Example 33
Type:
Small organic molecule
Emp. Form.:
C26H23N3OS
Mol. Mass.:
425.545
SMILES:
O=C(N1CC2CN(CC2C1)c1ccc2ccccc2n1)c1ccccc1-c1cccs1
: