Target
Macrophage colony-stimulating factor 1 receptor
Ligand
BDBM119045
Substrate
Meas. Tech.
Fluorescence Polarization Competition Assay
pH
7.5±n/a
IC50
0.93±n/a nM
Comments
extracted
Citation
 Illig, CRBallentine, SKChen, JDesJariais, RLMeegalla, SKWall, MWilson, K Inhibitors of C-FMS kinase US Patent  US8674100 Publication Date 3/18/2014 
Target
Name:
Macrophage colony-stimulating factor 1 receptor
Synonyms:
CSF1R_MOUSE Csfmr Macrophage colony-stimulating factor 1 receptor Proto-oncogene c-Fms
Type:
Protein
Mol. Mass.:
109173.45
Organism:
Mus musculus (Mouse)
Description:
P09581
Residue:
977
  
Inhibitor
Name:
BDBM119045
Synonyms:
US8674100, 64
Type:
Small organic molecule
Emp. Form.:
C28H35N6NaO3
Mol. Mass.:
526.6057
SMILES:
CC(C)(N1CCN(CC(=O)O[Na])CC1)c1ccc(NC(=O)c2ncc([nH]2)C#N)c(c1)C1=CCC(C)(C)CC1
: