Target
Macrophage colony-stimulating factor 1 receptor
Ligand
BDBM119064
Substrate
Meas. Tech.
Fluorescence Polarization Competition Assay
pH
7.5±n/a
IC50
0.82±n/a nM
Comments
extracted
Citation
 Illig, CRBallentine, SKChen, JDesJariais, RLMeegalla, SKWall, MWilson, K Inhibitors of C-FMS kinase US Patent  US8674100 Publication Date 3/18/2014 
Target
Name:
Macrophage colony-stimulating factor 1 receptor
Synonyms:
CSF1R_MOUSE Csfmr Macrophage colony-stimulating factor 1 receptor Proto-oncogene c-Fms
Type:
Protein
Mol. Mass.:
109173.45
Organism:
Mus musculus (Mouse)
Description:
P09581
Residue:
977
  
Inhibitor
Name:
BDBM119064
Synonyms:
US8674100, 151
Type:
Small organic molecule
Emp. Form.:
C24H30N6O
Mol. Mass.:
418.5346
SMILES:
CC1(C)CCC(=CC1)c1cc(CN2CCNCC2)ccc1NC(=O)c1ncc([nH]1)C#N
: