Target
Trace amine-associated receptor 1
Ligand
BDBM119204
Substrate
Meas. Tech.
Radioligand Binding Assay
Ki
1.9±n/a nM
Citation
 Nettekoven, MNorcross, RPolara, A Dihydrooxazol-2-amine derivatives US Patent  US8673950 Publication Date 3/18/2014 
Target
Name:
Trace amine-associated receptor 1
Synonyms:
TAAR1_MOUSE Taar1 Trace amine receptor 1 (TARR1) Trace amine-associated receptor1 | Trar1
Type:
Protein
Mol. Mass.:
37635.41
Organism:
Mus musculus (Mouse)
Description:
Q923Y8
Residue:
332
  
Inhibitor
Name:
BDBM119204
Synonyms:
US8673950, 72
Type:
Small organic molecule
Emp. Form.:
C16H18ClN5O
Mol. Mass.:
331.8
SMILES:
Cc1cc(CC[C@H]2COC(N)=N2)ccc1Nc1ncc(Cl)cn1
: