Target
Enoyl-acyl carrier reductase ENR
Ligand
BDBM25407
Substrate
Meas. Tech.
TgENR Inhibition Assay
pH
7.5±n/a
IC50
8±0.0 nM
Comments
extracted
Citation
 Afanador, GAMuench, SPMcPhillie, MFomovska, ASchön, ASchön, YCheng, GStec, JFreundlich, JSShieh, HMAnderson, JWJacobus, DPFidock, DAKozikowski, APFishwick, CWRice, DWFreire, EMcLeod, RPrigge, ST Discrimination of potent inhibitors of Toxoplasma gondii enoyl-acyl carrier protein reductase by a thermal shift assay. Biochemistry 52:9155-66 (2013)  
Target
Name:
Enoyl-acyl carrier reductase ENR
Synonyms:
Enoyl-acyl carrier reductase Enoyl-acyl carrier reductase, putative
Type:
PROTEIN
Mol. Mass.:
43663.67
Organism:
Toxoplasma gondii
Description:
ChEMBL_1290812
Residue:
417
  
Inhibitor
Name:
BDBM25407
Synonyms:
2‐(2,4‐dichlorophenoxy)‐5‐ethylphenol (11) Triclosan derivative, 8
Type:
Small organic molecule
Emp. Form.:
C14H12Cl2O2
Mol. Mass.:
283.15
SMILES:
CCc1ccc(Oc2ccc(Cl)cc2Cl)c(O)c1
: