Target
Matrix metalloproteinase-9
Ligand
BDBM92445
Substrate
Meas. Tech.
Inhibition Assay
Ki
>1000±n/a nM
Citation
 Devel, LBeau, FCzarny, BDive, V Pseudodipeptides as MMP inhibitors US Patent  US8691753 Publication Date 4/8/2014 
Target
Name:
Matrix metalloproteinase-9
Synonyms:
67 kDa matrix metalloproteinase-9 92 kDa gelatinase CLG4B Gelatinase B MMP9 Matrix metalloproteinase 9 (MMP-9) Matrix metalloproteinase-9 (MMP9)
Type:
Enzyme
Mol. Mass.:
78452.28
Organism:
Homo sapiens (Human)
Description:
P14780
Residue:
707
  
Inhibitor
Name:
BDBM92445
Synonyms:
Inhibitor, 10 | US8691753, 105
Type:
Small organic molecule
Emp. Form.:
C24H24N2O4S
Mol. Mass.:
436.523
SMILES:
NC(=O)[C@H](CCC(O)=O)NC(=O)CCc1ccc(cc1)-c1cc(cs1)-c1ccccc1
: