Target
Macrophage metalloelastase
Ligand
BDBM120256
Substrate
Meas. Tech.
Inhibition Assay
Ki
4.3±n/a nM
Citation
 Devel, LBeau, FCzarny, BDive, V Pseudodipeptides as MMP inhibitors US Patent  US8691753 Publication Date 4/8/2014 
Target
Name:
Macrophage metalloelastase
Synonyms:
HME MMP12_HUMAN Matrix metalloproteinase-12 (MMP 12) Matrix metalloproteinase-12 (MMP12) | Matrix metalloproteinases 12 (MMP-12)
Type:
Enzyme
Mol. Mass.:
54012.99
Organism:
Homo sapiens (Human)
Description:
P39900
Residue:
470
  
Inhibitor
Name:
BDBM120256
Synonyms:
US8691753, 106
Type:
Small organic molecule
Emp. Form.:
C32H30N2O6S
Mol. Mass.:
570.655
SMILES:
OC(=O)CC[C@H](NC(=O)CCc1ccc(cc1)-c1cc(cs1)-c1ccccc1)C(=O)Nc1cccc(CC(O)=O)c1
: