Target
Tyrosine-protein kinase ABL1
Ligand
BDBM120395
Substrate
Meas. Tech.
Enzyme Assay
pH
7.5±n/a
Temperature
301.15±n/a K
IC50
5.3±n/a nM
Comments
extracted
Citation
 Yang, XXue, LLuo, J Preparation method of dihydroindene amide compounds, their pharmaceutical compositions containing compounds thereof and use as protein kinases inhibitor US Patent  US8703771 Publication Date 4/22/2014 
Target
Name:
Tyrosine-protein kinase ABL1
Synonyms:
ABL ABL1_HUMAN JTK7 Proto-oncogene tyrosine-protein kinase ABL1 Tyrosine-protein kinase ABL V-abl Abelson murine leukemia viral oncogene homolog 1 p150 | tyrosine-protein kinase ABL1 isoform a
Type:
Enzyme
Mol. Mass.:
122897.30
Organism:
Homo sapiens (Human)
Description:
P00519
Residue:
1130
  
Inhibitor
Name:
BDBM120395
Synonyms:
US8703771, 13 US8703771, 8
Type:
Small organic molecule
Emp. Form.:
C30H32N8O
Mol. Mass.:
520.6281
SMILES:
CN1CCN(CC1)C1CCc2cc(ccc12)C(=O)Nc1ccc(C)c(Nc2nccc(n2)-c2cncnc2)c1
: