Target
Diacylglycerol O-acyltransferase 1 [89-488]
Ligand
BDBM120760
Substrate
Meas. Tech.
Inhibition Assay
pH
7.5±n/a
Temperature
277.15±n/a K
IC50
239.5±n/a nM
Comments
extracted
Citation
 Forster, CJKwak, YNakajima, KWang, B Organic compounds US Patent  US8703761 Publication Date 4/22/2014 
Target
Name:
Diacylglycerol O-acyltransferase 1 [89-488]
Synonyms:
AGRP1 DGAT1 acyl coA-diacylglycerol acyl transferase 1 (DGAT1)
Type:
Protein
Mol. Mass.:
46366.89
Organism:
Homo sapiens (Human)
Description:
O75907[89-488]
Residue:
400
  
Inhibitor
Name:
BDBM120760
Synonyms:
US8703761, 8-2
Type:
Small organic molecule
Emp. Form.:
C28H31N3O3
Mol. Mass.:
457.564
SMILES:
Cc1ccc(cc1)-c1cc(NC(=O)[C@@H]2CCCN2C(=O)OC(C)(C)C)nc(c1)-c1ccccc1
: