Target
Galectin-3
Ligand
BDBM120769
Substrate
Meas. Tech.
Fluorescence Polarization-Based Assay
Kd
59000±n/a nM
Citation
 Leffler, HNilsson, UJVon Wachenfeldt, H Galactoside inhibitors of galectins US Patent  US8703720 Publication Date 4/22/2014 
Target
Name:
Galectin-3
Synonyms:
LEG3_HUMAN MAC2
Type:
Enzyme
Mol. Mass.:
26156.54
Organism:
Homo sapiens (Human)
Description:
P17931
Residue:
250
  
Inhibitor
Name:
BDBM120769
Synonyms:
US8703720, Reference Compound 2
Type:
Small organic molecule
Emp. Form.:
C15H27NO11
Mol. Mass.:
397.375
SMILES:
CO[C@@H]1OC(CO)[C@@H](O[C@@H]2OC(CO)[C@H](O)[C@H](O)C2O)[C@H](O)C1NC(C)=O
: