Target
Galectin-3
Ligand
BDBM120771
Substrate
Meas. Tech.
Fluorescence Polarization-Based Assay
Kd
230±n/a nM
Citation
 Leffler, HNilsson, UJVon Wachenfeldt, H Galactoside inhibitors of galectins US Patent  US8703720 Publication Date 4/22/2014 
Target
Name:
Galectin-3
Synonyms:
LEG3_HUMAN MAC2
Type:
Enzyme
Mol. Mass.:
26156.54
Organism:
Homo sapiens (Human)
Description:
P17931
Residue:
250
  
Inhibitor
Name:
BDBM120771
Synonyms:
US8703720, 15
Type:
Small organic molecule
Emp. Form.:
C28H30F2N6O5S
Mol. Mass.:
600.637
SMILES:
OCC1O[C@@H](S[C@@H]2CCCC(C2O)n2cc(nn2)-c2ccccc2F)C(O)[C@H]([C@H]1O)n1cc(nn1)-c1ccccc1F
: