Target
Galectin-3
Ligand
BDBM120772
Substrate
Meas. Tech.
Fluorescence Polarization-Based Assay
Kd
150±n/a nM
Citation
 Leffler, HNilsson, UJVon Wachenfeldt, H Galactoside inhibitors of galectins US Patent  US8703720 Publication Date 4/22/2014 
Target
Name:
Galectin-3
Synonyms:
LEG3_HUMAN MAC2
Type:
Enzyme
Mol. Mass.:
26156.54
Organism:
Homo sapiens (Human)
Description:
P17931
Residue:
250
  
Inhibitor
Name:
BDBM120772
Synonyms:
US8703720, 16
Type:
Small organic molecule
Emp. Form.:
C28H30F2N6O5S
Mol. Mass.:
600.637
SMILES:
OCC1O[C@@H](S[C@@H]2CCCC(C2O)n2cc(nn2)-c2cccc(F)c2)C(O)[C@H]([C@H]1O)n1cc(nn1)-c1cccc(F)c1
: