Target
Galectin-3
Ligand
BDBM120775
Substrate
Meas. Tech.
Fluorescence Polarization-Based Assay
Kd
190±n/a nM
Citation
 Leffler, HNilsson, UJVon Wachenfeldt, H Galactoside inhibitors of galectins US Patent  US8703720 Publication Date 4/22/2014 
Target
Name:
Galectin-3
Synonyms:
LEG3_HUMAN MAC2
Type:
Enzyme
Mol. Mass.:
26156.54
Organism:
Homo sapiens (Human)
Description:
P17931
Residue:
250
  
Inhibitor
Name:
BDBM120775
Synonyms:
US8703720, 19
Type:
Small organic molecule
Emp. Form.:
C24H38N8O7S
Mol. Mass.:
582.673
SMILES:
CCCNC(=O)c1cn(nn1)C1CCC[C@@H](S[C@@H]2OC(CO)[C@H](O)[C@@H](C2O)n2cc(nn2)C(=O)NCCC)C1O
: