Target
Serine/threonine-protein kinase Chk1
Ligand
BDBM120916
Substrate
Meas. Tech.
Inhibiting Assay
pH
7.5±n/a
IC50
0.28±n/a nM
Citation
 Boyle, RGWalker, DWBoyce, RJ Pharmaceutical compounds US Patent  US8716287 Publication Date 5/6/2014 
Target
Name:
Serine/threonine-protein kinase Chk1
Synonyms:
CHEK1 CHK1 checkpoint homolog Checkpoint kinase-1 (CHK1)
Type:
Enzyme Catalytic Domain
Mol. Mass.:
54443.02
Organism:
Homo sapiens (Human)
Description:
gi_166295192
Residue:
476
  
Inhibitor
Name:
BDBM120916
Synonyms:
US8716287, 49
Type:
Small organic molecule
Emp. Form.:
C23H23ClN6O3
Mol. Mass.:
466.92
SMILES:
COc1ccc(CNCCc2cc(OC)c(NC(=O)Nc3cnc(cn3)C#N)cc2Cl)cc1
: