Target
Phosphatidylinositol 4,5-bisphosphate 3-kinase catalytic subunit gamma isoform
Ligand
BDBM126955
Substrate
Meas. Tech.
PI 3-Kinase HTRF Assay
Temperature
298.15±n/a K
IC50
<100±n/a nM
Comments
extracted
Citation
 Jessen, KGuo, XRen, PRommel, CLiu, Y Combination of kinase inhibitors and uses thereof US Patent  US9682141 Publication Date 6/20/2017 
Target
Name:
Phosphatidylinositol 4,5-bisphosphate 3-kinase catalytic subunit gamma isoform
Synonyms:
PI3-kinase p110 subunit gamma PI3Kgamma PK3CG_HUMAN Phosphatidylinositol 4,5-bisphosphate 3-kinase (PI3K) Phosphatidylinositol 4,5-bisphosphate 3-kinase catalytic subunit gamma (PI3Kgamma) Phosphatidylinositol 4,5-bisphosphate 3-kinase catalytic subunit gamma isoform (PI3K) Phosphatidylinositol-4,5-bisphosphate 3-kinase catalytic subunit gamma isoform Phosphoinositide 3-kinases gamma (PI3K gamma) p120-PI3K
Type:
Enzyme Subunit
Mol. Mass.:
126470.30
Organism:
Homo sapiens (Human)
Description:
P48736
Residue:
1102
  
Inhibitor
Name:
BDBM126955
Synonyms:
US11547697, Compound 173 | US9682141, 173
Type:
Small organic molecule
Emp. Form.:
C20H19N5O2
Mol. Mass.:
361.3972
SMILES:
CC1CN(CCO1)c1cnc2ccc(cc2n1)-c1ccc2oc(N)nc2c1
: