Target
C-C chemokine receptor type 3
Ligand
BDBM123076
Substrate
Meas. Tech.
Scintillation Proximity Assay
Ki
3.5±n/a nM
Citation
 Frank, MHaeberle, HHenry, MPachur, TSantagostino, MStertz, UTrebing, TWerthmann, U Co-crystals and salts of CCR3-inhibitors US Patent  US8742115 Publication Date 6/3/2014 
Target
Name:
C-C chemokine receptor type 3
Synonyms:
C-C CKR-3 CC-CKR-3 CCR3 CD_antigen=CD193 CMKBR3 | Eosinophil eotaxin receptor
Type:
Enzyme
Mol. Mass.:
41053.88
Organism:
Homo sapiens (Human)
Description:
P51677
Residue:
355
  
Inhibitor
Name:
BDBM123076
Synonyms:
US10213421, Example 3 US8742115, 15
Type:
Small organic molecule
Emp. Form.:
C29H36ClN5O3
Mol. Mass.:
538.081
SMILES:
Cc1cc(cc(NC(=O)[C@H]2CCC(=O)N2C2CCN(Cc3ccc(Cl)c(C)c3)CC2)n1)C(=O)NCC1CC1
: