Target
Somatostatin receptor type 5
Ligand
BDBM123156
Substrate
Meas. Tech.
Binding Assay
pH
7.8±n/a
IC50
1.533±n/a nM
Comments
extracted
Citation
 Duffy, JLBao, JOndeyka, DLTyagarajan, SShao, PYe, FKatipally, RZwicker, ASherer, ECPlotkin, MAMoningka, RHussain, ZWood, HBUjjainwalla, FRomero, FAFinke, PEZang, YLiu, W Spiroxazolidinone compounds US Patent  US8742110 Publication Date 6/3/2014 
Target
Name:
Somatostatin receptor type 5
Synonyms:
SOMATOSTATIN SST5 SS5-R SSR5_HUMAN Somatostatin receptor type 5 (SSTR5)
Type:
Enzyme
Mol. Mass.:
39218.02
Organism:
Homo sapiens (Human)
Description:
P35346
Residue:
364
  
Inhibitor
Name:
BDBM123156
Synonyms:
US8742110, 1-5
Type:
Small organic molecule
Emp. Form.:
C31H33F3N4O4
Mol. Mass.:
582.6133
SMILES:
OC(=O)c1ccc(cc1)N1CC2(CCN(Cc3cn(nc3-c3cccc(c3)C(F)(F)F)C3CCCCC3)CC2)OC1=O
: