Target
Somatostatin receptor type 5
Ligand
BDBM123158
Substrate
Meas. Tech.
Binding Assay
pH
7.8±n/a
IC50
2.62±n/a nM
Comments
extracted
Citation
 Duffy, JLBao, JOndeyka, DLTyagarajan, SShao, PYe, FKatipally, RZwicker, ASherer, ECPlotkin, MAMoningka, RHussain, ZWood, HBUjjainwalla, FRomero, FAFinke, PEZang, YLiu, W Spiroxazolidinone compounds US Patent  US8742110 Publication Date 6/3/2014 
Target
Name:
Somatostatin receptor type 5
Synonyms:
SOMATOSTATIN SST5 SS5-R SSR5_HUMAN Somatostatin receptor type 5 (SSTR5)
Type:
Enzyme
Mol. Mass.:
39218.02
Organism:
Homo sapiens (Human)
Description:
P35346
Residue:
364
  
Inhibitor
Name:
BDBM123158
Synonyms:
US8742110, 1-7
Type:
Small organic molecule
Emp. Form.:
C28H29F3N4O4
Mol. Mass.:
542.5495
SMILES:
CC(C)(C)n1cc(CN2CCC3(CN(C(=O)O3)c3ccc(cc3)C(O)=O)CC2)c(n1)-c1cc(F)c(F)cc1F
: