Target
Somatostatin receptor type 5
Ligand
BDBM123163
Substrate
Meas. Tech.
Binding Assay
pH
7.8±n/a
IC50
5.324±n/a nM
Comments
extracted
Citation
 Duffy, JLBao, JOndeyka, DLTyagarajan, SShao, PYe, FKatipally, RZwicker, ASherer, ECPlotkin, MAMoningka, RHussain, ZWood, HBUjjainwalla, FRomero, FAFinke, PEZang, YLiu, W Spiroxazolidinone compounds US Patent  US8742110 Publication Date 6/3/2014 
Target
Name:
Somatostatin receptor type 5
Synonyms:
SOMATOSTATIN SST5 SS5-R SSR5_HUMAN Somatostatin receptor type 5 (SSTR5)
Type:
Enzyme
Mol. Mass.:
39218.02
Organism:
Homo sapiens (Human)
Description:
P35346
Residue:
364
  
Inhibitor
Name:
BDBM123163
Synonyms:
US8742110, 1-12
Type:
Small organic molecule
Emp. Form.:
C32H32N4O5
Mol. Mass.:
552.6203
SMILES:
CCOc1ccc(cc1)-c1nn(cc1CN1CCC2(CN(C(=O)O2)c2ccc(cc2)C(O)=O)CC1)-c1ccccc1
: