Target
Somatostatin receptor type 5
Ligand
BDBM123165
Substrate
Meas. Tech.
Binding Assay
pH
7.8±n/a
IC50
4.702±n/a nM
Comments
extracted
Citation
 Duffy, JLBao, JOndeyka, DLTyagarajan, SShao, PYe, FKatipally, RZwicker, ASherer, ECPlotkin, MAMoningka, RHussain, ZWood, HBUjjainwalla, FRomero, FAFinke, PEZang, YLiu, W Spiroxazolidinone compounds US Patent  US8742110 Publication Date 6/3/2014 
Target
Name:
Somatostatin receptor type 5
Synonyms:
SOMATOSTATIN SST5 SS5-R SSR5_HUMAN Somatostatin receptor type 5 (SSTR5)
Type:
Enzyme
Mol. Mass.:
39218.02
Organism:
Homo sapiens (Human)
Description:
P35346
Residue:
364
  
Inhibitor
Name:
BDBM123165
Synonyms:
US8742110, 1-14 | US8742110, 1-15
Type:
Small organic molecule
Emp. Form.:
C29H34N4O5
Mol. Mass.:
518.6041
SMILES:
COc1ccccc1-c1nn(cc1CN1CCC2(CN(C(=O)O2)c2ccc(cc2)C(O)=O)CC1)C(C)(C)C
: