Target
Somatostatin receptor type 5
Ligand
BDBM123172
Substrate
Meas. Tech.
Binding Assay
pH
7.8±n/a
IC50
3.214±n/a nM
Comments
extracted
Citation
 Duffy, JLBao, JOndeyka, DLTyagarajan, SShao, PYe, FKatipally, RZwicker, ASherer, ECPlotkin, MAMoningka, RHussain, ZWood, HBUjjainwalla, FRomero, FAFinke, PEZang, YLiu, W Spiroxazolidinone compounds US Patent  US8742110 Publication Date 6/3/2014 
Target
Name:
Somatostatin receptor type 5
Synonyms:
SOMATOSTATIN SST5 SS5-R SSR5_HUMAN Somatostatin receptor type 5 (SSTR5)
Type:
Enzyme
Mol. Mass.:
39218.02
Organism:
Homo sapiens (Human)
Description:
P35346
Residue:
364
  
Inhibitor
Name:
BDBM123172
Synonyms:
US8742110, 1-21
Type:
Small organic molecule
Emp. Form.:
C32H27F3N4O6
Mol. Mass.:
620.5752
SMILES:
OC(=O)c1ccc(cc1)N1CC2(CCN(Cc3cn(nc3-c3ccc(F)c(F)c3F)-c3cccc4OCCOc34)CC2)OC1=O
: