Target
Somatostatin receptor type 5
Ligand
BDBM123173
Substrate
Meas. Tech.
Binding Assay
pH
7.8±n/a
IC50
4.87±n/a nM
Comments
extracted
Citation
 Duffy, JLBao, JOndeyka, DLTyagarajan, SShao, PYe, FKatipally, RZwicker, ASherer, ECPlotkin, MAMoningka, RHussain, ZWood, HBUjjainwalla, FRomero, FAFinke, PEZang, YLiu, W Spiroxazolidinone compounds US Patent  US8742110 Publication Date 6/3/2014 
Target
Name:
Somatostatin receptor type 5
Synonyms:
SOMATOSTATIN SST5 SS5-R SSR5_HUMAN Somatostatin receptor type 5 (SSTR5)
Type:
Enzyme
Mol. Mass.:
39218.02
Organism:
Homo sapiens (Human)
Description:
P35346
Residue:
364
  
Inhibitor
Name:
BDBM123173
Synonyms:
US8742110, 1-22
Type:
Small organic molecule
Emp. Form.:
C31H30N4O5
Mol. Mass.:
538.5937
SMILES:
COc1cccc(c1)-c1nn(cc1CN1CCC2(CN(C(=O)O2)c2ccc(cc2)C(O)=O)CC1)-c1ccccc1
: