Target
Genome polyprotein
Ligand
BDBM123409
Substrate
Meas. Tech.
Inhibition Assay
pH
7.5±n/a
Temperature
303.15±n/a K
Ki
1000±n/a nM
Comments
extracted
Citation
 Simmen, KADe Kock, HARaboisson, PJHu, LTahri, ASurleraux, DLNilsson, KMSamuelsson, BBRosenquist, AIvanov, VPelcman, MBelfrage, AKJohansson, PMVendeville, SM Macrocyclic inhibitors of hepatitis C virus US Patent  US8741926 Publication Date 6/3/2014 
Target
Name:
Genome polyprotein
Synonyms:
NS3-4A protease
Type:
Enzyme
Mol. Mass.:
72788.46
Organism:
Hepatitis C virus
Description:
K7XGM7
Residue:
681
  
Inhibitor
Name:
BDBM123409
Synonyms:
US8741926, 81
Type:
Small organic molecule
Emp. Form.:
C35H42N4O6S
Mol. Mass.:
646.796
SMILES:
COc1ccc2c(O[C@H]3C[C@@H]4[C@@H](C3)C(=O)N[C@@]3(C[C@H]3\C=C/CCCCCNC4=O)C(O)=O)cc(nc2c1C)-c1nc(cs1)C(C)C
: