Target
Genome polyprotein
Ligand
BDBM123415
Substrate
Meas. Tech.
Inhibition Assay
pH
7.5±n/a
Temperature
303.15±n/a K
Ki
0.1±n/a nM
Comments
extracted
Citation
 Simmen, KADe Kock, HARaboisson, PJHu, LTahri, ASurleraux, DLNilsson, KMSamuelsson, BBRosenquist, AIvanov, VPelcman, MBelfrage, AKJohansson, PMVendeville, SM Macrocyclic inhibitors of hepatitis C virus US Patent  US8741926 Publication Date 6/3/2014 
Target
Name:
Genome polyprotein
Synonyms:
NS3-4A protease
Type:
Enzyme
Mol. Mass.:
72788.46
Organism:
Hepatitis C virus
Description:
K7XGM7
Residue:
681
  
Inhibitor
Name:
BDBM123415
Synonyms:
US8741926, 95 | US8754106, 95
Type:
Small organic molecule
Emp. Form.:
C37H45ClN6O7S2
Mol. Mass.:
785.372
SMILES:
COc1ccc2c(O[C@@H]3C[C@@H]4N(C3)C(=O)NCCCCC\C=C/[C@@H]3C[C@]3(NC4=O)C(=O)NS(=O)(=O)C3(C)CC3)cc(nc2c1Cl)-c1nc(cs1)C(C)C
: