Target
Urease [D459Y,K653P]
Ligand
BDBM123725
Substrate
Meas. Tech.
Urease Inhibition Assay
Temperature
303.15±0 K
IC50
4.53e+4± 8.1e+3 nM
Citation
 Akhtar, TKhan, MAIqbal, JJones, PGHameed, S A facile one-pot synthesis of 2-arylamino-5-aryloxylalkyl-1,3,4-oxadiazoles and their urease inhibition studies. Chem Biol Drug Des 84:92-8 (2014)  
Target
Name:
Urease [D459Y,K653P]
Synonyms:
UREA_CANEN Urease
Type:
Protein
Mol. Mass.:
90763.23
Organism:
Canavalia ensiformis (Jack bean)
Description:
P07374[D459Y,K653P]
Residue:
840
  
Inhibitor
Name:
BDBM123725
Synonyms:
2-(4-Fluorophenyl)amino)-5-(1-(3,4-dichlorophenoxy)ethyl)-1,3,4-oxadiazole (3i)
Type:
Small organic molecule
Emp. Form.:
C16H12Cl2FN3O2
Mol. Mass.:
368.19
SMILES:
CC(Oc1ccc(Cl)c(Cl)c1)c1nnc(Nc2ccc(F)cc2)o1
: