Target
Amine oxidase [flavin-containing] B
Ligand
BDBM123815
Substrate
Meas. Tech.
Human MAO inhibitory test
pH
7.4±0
Temperature
310.15±0 K
Ki
2.45e+4± 1.4e+3 nM
Citation
 Rane, RANapahde, SBangalore, PKSahu, NUShah, NKulkarni, YABarve, KLokare, LKarpoormath, R Synthesis and evaluation of novel marine bromopyrrole alkaloid-based derivatives as potential antidepressant agents. Chem Biol Drug Des 84:593-602 (2014)  
Target
Name:
Amine oxidase [flavin-containing] B
Synonyms:
AOFB_HUMAN MAOB Monoamine oxidase type B (MAO B) Monoamine oxidase type B (MAOB)
Type:
Protein
Mol. Mass.:
58768.76
Organism:
Homo sapiens (Human)
Description:
P27338
Residue:
520
  
Inhibitor
Name:
BDBM123815
Synonyms:
4,5-dibromo-N'-(4-fluorobenzylidene)-1H-pyrrole-2- carbohydrazide (4b)
Type:
Small organic molecule
Emp. Form.:
C12H8Br2FN3O
Mol. Mass.:
389.018
SMILES:
Fc1ccc(C=NNC(=O)c2cc(Br)c(Br)[nH]2)cc1
: