Target
Amine oxidase [flavin-containing] B
Ligand
BDBM123823
Substrate
Meas. Tech.
Human MAO inhibitory test
pH
7.4±0
Temperature
310.15±0 K
Ki
3.1e+3± 8.7e+2 nM
Citation
 Rane, RANapahde, SBangalore, PKSahu, NUShah, NKulkarni, YABarve, KLokare, LKarpoormath, R Synthesis and evaluation of novel marine bromopyrrole alkaloid-based derivatives as potential antidepressant agents. Chem Biol Drug Des 84:593-602 (2014)  
Target
Name:
Amine oxidase [flavin-containing] B
Synonyms:
AOFB_HUMAN MAOB Monoamine oxidase type B (MAO B) Monoamine oxidase type B (MAOB)
Type:
Protein
Mol. Mass.:
58768.76
Organism:
Homo sapiens (Human)
Description:
P27338
Residue:
520
  
Inhibitor
Name:
BDBM123823
Synonyms:
4,5-dibromo-N'-[(2,4-dichlorophenyl)methylidene]-1H-pyrrole-2-carbohydrazide (4j)
Type:
Small organic molecule
Emp. Form.:
C12H7Br2Cl2N3O
Mol. Mass.:
439.917
SMILES:
Clc1ccc(C=NNC(=O)c2cc(Br)c(Br)[nH]2)c(Cl)c1
: