Target
Amine oxidase [flavin-containing] B
Ligand
BDBM123826
Substrate
Meas. Tech.
Human MAO inhibitory test
pH
7.4±0
Temperature
310.15±0 K
Ki
6.9e+3± 2.6e+3 nM
Citation
 Rane, RANapahde, SBangalore, PKSahu, NUShah, NKulkarni, YABarve, KLokare, LKarpoormath, R Synthesis and evaluation of novel marine bromopyrrole alkaloid-based derivatives as potential antidepressant agents. Chem Biol Drug Des 84:593-602 (2014)  
Target
Name:
Amine oxidase [flavin-containing] B
Synonyms:
AOFB_HUMAN MAOB Monoamine oxidase type B (MAO B) Monoamine oxidase type B (MAOB)
Type:
Protein
Mol. Mass.:
58768.76
Organism:
Homo sapiens (Human)
Description:
P27338
Residue:
520
  
Inhibitor
Name:
BDBM123826
Synonyms:
4,5-dibromo-1-methyl-N'-(4-nitrobenzylidene)-1H-pyrrole-2-carbohydrazide (5c)
Type:
Small organic molecule
Emp. Form.:
C13H10Br2N4O3
Mol. Mass.:
430.051
SMILES:
Cn1c(Br)c(Br)cc1C(=O)NN=Cc1ccc(cc1)[N+]([O-])=O
: