Target
Amine oxidase [flavin-containing] B
Ligand
BDBM123830
Substrate
Meas. Tech.
Human MAO inhibitory test
pH
7.4±0
Temperature
310.15±0 K
Ki
2.1e+3± 9.2e+2 nM
Citation
 Rane, RANapahde, SBangalore, PKSahu, NUShah, NKulkarni, YABarve, KLokare, LKarpoormath, R Synthesis and evaluation of novel marine bromopyrrole alkaloid-based derivatives as potential antidepressant agents. Chem Biol Drug Des 84:593-602 (2014)  
Target
Name:
Amine oxidase [flavin-containing] B
Synonyms:
AOFB_HUMAN MAOB Monoamine oxidase type B (MAO B) Monoamine oxidase type B (MAOB)
Type:
Protein
Mol. Mass.:
58768.76
Organism:
Homo sapiens (Human)
Description:
P27338
Residue:
520
  
Inhibitor
Name:
BDBM123830
Synonyms:
4,5-dibromo-N'-(4-chlorobenzylidene)-1-methyl-1H-pyrrole-2-carbohydrazide (5g)
Type:
Small organic molecule
Emp. Form.:
C13H10Br2ClN3O
Mol. Mass.:
419.499
SMILES:
Cn1c(Br)c(Br)cc1C(=O)NN=Cc1ccc(Cl)cc1
: