Target
Amine oxidase [flavin-containing] B
Ligand
BDBM123831
Substrate
Meas. Tech.
Human MAO inhibitory test
pH
7.4±0
Temperature
310.15±0 K
Ki
3.4e+3± 6.6e+2 nM
Citation
 Rane, RANapahde, SBangalore, PKSahu, NUShah, NKulkarni, YABarve, KLokare, LKarpoormath, R Synthesis and evaluation of novel marine bromopyrrole alkaloid-based derivatives as potential antidepressant agents. Chem Biol Drug Des 84:593-602 (2014)  
Target
Name:
Amine oxidase [flavin-containing] B
Synonyms:
AOFB_HUMAN MAOB Monoamine oxidase type B (MAO B) Monoamine oxidase type B (MAOB)
Type:
Protein
Mol. Mass.:
58768.76
Organism:
Homo sapiens (Human)
Description:
P27338
Residue:
520
  
Inhibitor
Name:
BDBM123831
Synonyms:
4,5-dibromo-N'-(3,4-dimethoxybenzylidene)-1-methyl-1H-pyrrole-2-carbohydrazide (5h)
Type:
Small organic molecule
Emp. Form.:
C15H15Br2N3O3
Mol. Mass.:
445.106
SMILES:
COc1ccc(C=NNC(=O)c2cc(Br)c(Br)n2C)cc1OC
: