Target
Amine oxidase [flavin-containing] B
Ligand
BDBM123832
Substrate
Meas. Tech.
Human MAO inhibitory test
pH
7.4±0
Temperature
310.15±0 K
Ki
2.9e+3± 1.1e+3 nM
Citation
 Rane, RANapahde, SBangalore, PKSahu, NUShah, NKulkarni, YABarve, KLokare, LKarpoormath, R Synthesis and evaluation of novel marine bromopyrrole alkaloid-based derivatives as potential antidepressant agents. Chem Biol Drug Des 84:593-602 (2014)  
Target
Name:
Amine oxidase [flavin-containing] B
Synonyms:
AOFB_HUMAN MAOB Monoamine oxidase type B (MAO B) Monoamine oxidase type B (MAOB)
Type:
Protein
Mol. Mass.:
58768.76
Organism:
Homo sapiens (Human)
Description:
P27338
Residue:
520
  
Inhibitor
Name:
BDBM123832
Synonyms:
4,5-dibromo-N'-(4-methoxybenzylidene)-1-methyl-1H-pyrrole-2-carbohydrazide (5i)
Type:
Small organic molecule
Emp. Form.:
C14H13Br2N3O2
Mol. Mass.:
415.08
SMILES:
COc1ccc(C=NNC(=O)c2cc(Br)c(Br)n2C)cc1
: