Target
Proto-oncogene tyrosine-protein kinase receptor Ret [658-1114,V804M]
Ligand
BDBM284415
Substrate
Meas. Tech.
RET Enzyme Assay
pH
7.4±n/a
IC50
71.4±n/a nM
Comments
extracted
Citation
 Andrews, SWBlake, JFChicarelli, MJGolos, AHaas, JJiang, YKolakowski, GR Substituted pyrazolo[1,5-A]pyridine compounds as RET kinase inhibitors US Patent  US10023570 Publication Date 7/17/2018 
Target
Name:
Proto-oncogene tyrosine-protein kinase receptor Ret [658-1114,V804M]
Synonyms:
CDHF12 PTC Proto-oncogene tyrosine-protein kinase receptor Ret (V804M) RET Kinase (V804M) (aa658-end) RET_HUMAN
Type:
Enzyme Catalytic Domain
Mol. Mass.:
51567.23
Organism:
Homo sapiens (Human)
Description:
P07949[658-1114,V804M]
Residue:
457
  
Inhibitor
Name:
BDBM284415
Synonyms:
4-(6-(4-(4- chlorobenzyl)piperazin-l- yl)pyridin-3-yl)-6-(1- methyl-1H-pyrazol-4- yl)pyrazolo[1,5-a]pyridine- 3-carbonitrile US10174028, Example 425
Type:
Small organic molecule
Emp. Form.:
C28H25ClN8
Mol. Mass.:
509.005
SMILES:
Cn1cc(cn1)-c1cc(-c2ccc(nc2)N2CCN(Cc3ccc(Cl)cc3)CC2)c2c(cnn2c1)C#N
: