Target
Genome polyprotein
Ligand
BDBM123414
Substrate
Meas. Tech.
Enzymatic Assay
Ki
0.25±n/a nM
Citation
 Simmen, KADe Kock, HARaboisson, PJHu, LTahri, ASurleraux, DLNilsson, KMSamuelsson, BBRosenquist, AAIvanov, VPelcman, MBelfrage, AKJohansson, PMVendeville, SM Macrocyclic inhibitors of hepatitis C virus US Patent  US8754106 Publication Date 6/17/2014 
Target
Name:
Genome polyprotein
Synonyms:
NS3/4A protein
Type:
Enzyme
Mol. Mass.:
73007.91
Organism:
Hepatitis C virus
Description:
B0B3F0
Residue:
685
  
Inhibitor
Name:
BDBM123414
Synonyms:
US8741926, 48 | US8754106, 48
Type:
Small organic molecule
Emp. Form.:
C39H49N5O7S2
Mol. Mass.:
763.966
SMILES:
COc1ccc2c(O[C@@H]3C[C@@H]4[C@@H](C3)C(=O)N(C)CCCC\C=C/[C@@H]3C[C@]3(NC4=O)C(=O)NS(=O)(=O)C3(C)CC3)cc(nc2c1C)-c1nc(cs1)C(C)C
: