Target
Tyrosine-protein phosphatase non-receptor type 4
Ligand
BDBM124263
Substrate
Meas. Tech.
PTP inhibition assay
pH
7.2±n/a
IC50
2.9e+3± 4e+3 nM
Comments
extracted
Citation
 Han, HLu, LWang, QZhu, MYuan, CXing, SFu, X Synthesis and evaluation of oxovanadium(IV) complexes of Schiff-base condensates from 5-substituted-2-hydroxybenzaldehyde and 2-substituted-benzenamine as selective inhibitors of protein tyrosine phosphatase 1B. Dalton Trans 41:11116-24 (2012)  
Target
Name:
Tyrosine-protein phosphatase non-receptor type 4
Synonyms:
Megakaryocyte protein-tyrosine phosphatase (PTP-MEG2) PTPN4 Tyrosine-protein phosphatase non-receptor type 4 (PTP-MEG1)
Type:
Protein
Mol. Mass.:
105923.44
Organism:
Homo sapiens (Human)
Description:
Residue:
926
  
Inhibitor
Name:
BDBM124263
Synonyms:
Bis(4-bromo-2-((phenylimino)methyl)phenolate)-oxovanadium(IV) (4)
Type:
Small organic molecule
Emp. Form.:
C26H18Br2N2O3V
Mol. Mass.:
617.182
SMILES:
Brc1ccc2O[V]3(=O)(Oc4ccc(Br)cc4C=[N]3c3ccccc3)[N](=Cc2c1)c1ccccc1
: