Target
Leucyl-cystinyl aminopeptidase
Ligand
BDBM284929
Substrate
Meas. Tech.
Inhibition of IRAP Activity
IC50
1.10±n/a nM
Citation
 Kawaguchi, KIshihata, AKanai, AInagaki, YHiramoto, MEnjo, KTakamatsu, H Bicyclic pyridine compound US Patent  US10023583 Publication Date 7/17/2018 
Target
Name:
Leucyl-cystinyl aminopeptidase
Synonyms:
Cystinyl aminopeptidase Insulin-regulated membrane aminopeptidase Irap Leucyl-cystinyl aminopeptidase Otase P-LAP Vesicle protein of 165 kDa | Vp165
Type:
PROTEIN
Mol. Mass.:
117179.39
Organism:
Rattus norvegicus
Description:
ChEMBL_98523
Residue:
1025
  
Inhibitor
Name:
BDBM284929
Synonyms:
US10023583, Example 2
Type:
Small organic molecule
Emp. Form.:
C18H24N2O4S
Mol. Mass.:
364.459
SMILES:
CSC[C@H](N)[C@](O)(Cc1nccc2oc(CCC3CC3)cc12)C(O)=O
: