Target
Cyclin-T1
Ligand
BDBM126517
Substrate
Meas. Tech.
IMAP Assay
IC50
0.001±n/a nM
Citation
 Barsanti, PAHu, CJin, JKeyes, RKucejko, RLin, XPan, YPfister, KBSendzik, MSutton, JWan, L Heteroaryl compounds and their uses US Patent  US8778951 Publication Date 7/15/2014 
Target
Name:
Cyclin-T1
Synonyms:
CCNT1 CycT Cyclin T Cyclin-T
Type:
Enzyme Subunit
Mol. Mass.:
80712.40
Organism:
Homo sapiens (Human)
Description:
Residue:
726
  
Inhibitor
Name:
BDBM126517
Synonyms:
US8778951, 328
Type:
Small organic molecule
Emp. Form.:
C28H42ClN5O2
Mol. Mass.:
516.118
SMILES:
COC[C@@H](C)N[C@H]1CC[C@@H](CC1)Nc1cc(c(Cl)cn1)-c1cccc(NC[C@H]2CCOC(C)(C)C2)n1
: