Target
Neuraminidase
Ligand
BDBM4705
Substrate
BDBM4702
Meas. Tech.
Neuraminidase Inhibition Assay
pH
6.5±n/a
Temperature
310.15±n/a K
IC50
5000000±n/a nM
Citation
 Chand, PBabu, YSBantia, SChu, NCole, LBKotian, PLLaver, WGMontgomery, JAPathak, VPPetty, SLShrout, DPWalsh, DAWalsh, GM Design and synthesis of benzoic acid derivatives as influenza neuraminidase inhibitors using structure-based drug design. J Med Chem 40:4030-52 (1997)  
Target
Name:
Neuraminidase
Synonyms:
Influenza A Virus Neuraminidase NRAM_I75A5 | Neuraminidase A
Type:
Enzyme
Mol. Mass.:
52468.81
Organism:
Influenza A virus (N9)
Description:
P03472
Residue:
470
  
Inhibitor
Name:
BDBM4705
Synonyms:
3-carbamimidamidobenzoic acid | Benzoic Acid deriv. 64
Type:
Small organic molecule
Emp. Form.:
C8H9N3O2
Mol. Mass.:
179.176
SMILES:
[#7]\[#6](-[#7])=[#7]/c1cccc(c1)-[#6](-[#8])=O
:
Substrate
Name:
BDBM4702
Synonyms:
(2R,4S,5R,6R)-5-acetamido-4-hydroxy-2-[(4-methyl-2-oxo-2H-chromen-7-yl)oxy]-6-[(1R,2R)-1,2,3-trihydroxypropyl]oxane-2-carboxylic acid neuraminidase substrate
Type:
Small organic molecule
Emp. Form.:
C21H25NO11
Mol. Mass.:
467.4233
SMILES:
CC(=O)N[C@@H]1[C@@H](O)C[C@](Oc2ccc3c(C)cc(=O)oc3c2)(O[C@H]1[C@H](O)[C@H](O)CO)C(O)=O
: