Target
Leucine-rich repeat serine/threonine-protein kinase 2
Ligand
BDBM127908
Substrate
Meas. Tech.
Lanthascreen Binding Assay
Ki
2±n/a nM
Citation
 Baker-Glenn, CChambers, MChan, BKEstrada, ASweeney, ZK Aminopyrimidine derivatives as LRRK2 modulators US Patent  US8791130 Publication Date 7/29/2014 
Target
Name:
Leucine-rich repeat serine/threonine-protein kinase 2
Synonyms:
Dardarin LRRK2_HUMAN Leucine-rich repeat serine/threonine-protein kinase 2 PARK8
Type:
Protein
Mol. Mass.:
286113.20
Organism:
Homo sapiens (Human)
Description:
Q5S007
Residue:
2527
  
Inhibitor
Name:
BDBM127908
Synonyms:
US8791130, 38
Type:
Small organic molecule
Emp. Form.:
C18H19F3N6O
Mol. Mass.:
392.3783
SMILES:
CNc1nc(Nc2ccc(cc2OC)-c2cn(C)nc2C)ncc1C(F)(F)F
: