Target
Epoxide hydrolase 1
Ligand
BDBM129324
Substrate
Meas. Tech.
Activity Assay
IC50
12600±n/a nM
Citation
 Hammock, BDZheng, JMorisseau, CMotoba, KMoghaddam, MFBorhan, BGrant, DFGreene, JSisemore, MFSanborn, J Inhibitors of epoxide hydrolases for the treatment of inflammation US Patent  US8815951 Publication Date 8/26/2014 
Target
Name:
Epoxide hydrolase 1
Synonyms:
Ephx1 Epoxide hydrolase (MsEH) | HYEP_MOUSE
Type:
Protein
Mol. Mass.:
52586.43
Organism:
Mus musculus (Mouse)
Description:
Q9D379
Residue:
455
  
Inhibitor
Name:
BDBM129324
Synonyms:
US8815951, Epoxide Hydrolase Inhibitor 2
Type:
Small organic molecule
Emp. Form.:
C15H14O2
Mol. Mass.:
226.2705
SMILES:
OC(C1OC1c1ccccc1)c1ccccc1
: